myid,agegp,addrgp3,sex,covidtest,covidresult,covidduration,oxygen,currentstatus,onsetnum,onsetgp,onsetgp2,t_not_sought,t_private_clinic,t_charity_clinic,t_home_visit,t_online_tele,t_OPD,t_private_hospital,t_public_hospital,t_other,d_home,d_charity_home,d_charity_clinic_hospital,d_private_clinic,d_private_hospital,d_public_hospital,d_road_car_other,s_fever,s_cough,s_runny_nose,s_sore_throat,s_anosmia,s_diarrhoea_vomitting,s_aches,s_appetite_loss,s_fatigue,s_headache,s_breathlessness,currentstatus2,currentstatus3
1,>60,Yangon,Male,Nasal/throat swab,Yes,11-15 days,Yes,Dead,Jul w3,July,July2,,,,1.0,,,,,,1.0,,,,,,,1.0,1.0,,,,,,,,,1.0,Dead,Dead
2,46-60,Yangon,Male,Not tested,Don't know/Not tested,>16 days,No,Complications,Jul w1,July,July1,1.0,,,,,,,,,1.0,,,,,,,1.0,1.0,1.0,,1.0,1.0,,,1.0,1.0,1.0,Complications,Other
3,>60,Mandalay,Male,Not tested,Don't know/Not tested,11-15 days,No,Dead,Jul w3,July,July2,,1.0,,,,,,,,1.0,,,,,,,1.0,1.0,,,,,,1.0,,,1.0,Dead,Dead
4,16-30,Mandalay,Male,Nasal/throat swab,Yes,11-15 days,Yes,Dead,Jun w2,June,June1,,,,,1.0,,,,,1.0,,,,,,,1.0,1.0,,,,,1.0,1.0,1.0,,1.0,Dead,Dead
5,16-30,Yangon,Female,Not tested,Don't know/Not tested,>16 days,No,Complications,Jul w1,July,July1,,,,,,,,,1.0,,,,,,,1.0,1.0,1.0,1.0,,1.0,,1.0,1.0,,1.0,1.0,Complications,Other
6,31-45,Yangon,Female,Not tested,Don't know/Not tested,3-5 days,No,Recovered,Jul w2,July,July1,,,,,1.0,,,,,,,,,,,1.0,1.0,,,,1.0,,,,,1.0,,Recovered,Recovered
7,31-45,Yangon,Male,Not tested,Don't know/Not tested,6-10 days,Yes,Dead,Jul w2,July,July1,,1.0,,,,,,,,1.0,,,,,,,1.0,1.0,,,,,1.0,1.0,,1.0,1.0,Dead,Dead
8,16-30,Yangon,Male,Nasal/throat swab,Yes,>16 days,No,Complications,Jul w1,July,July1,,,,,1.0,,,,,1.0,,,,,,,1.0,1.0,1.0,,1.0,,1.0,,1.0,1.0,,Complications,Other
9,46-60,Mandalay,Female,Not tested,Don't know/Not tested,>16 days,Yes,Dead,Jun w4,June,June2,,,,1.0,,,,,,1.0,,,,,,,1.0,1.0,,1.0,1.0,1.0,1.0,1.0,1.0,1.0,1.0,Dead,Dead
10,>60,Yangon,Female,Not tested,Don't know/Not tested,>16 days,Yes,Dead,Jul w2,July,July1,,,,1.0,1.0,,,,,1.0,,,,,,,1.0,,,,,,,1.0,1.0,,1.0,Dead,Dead
11,46-60,Yangon,Male,Nasal/throat swab,Yes,11-15 days,Yes,Dead,Jul w1,July,July1,,,,1.0,,,,,,1.0,,,,,,,1.0,,,,,,1.0,1.0,1.0,1.0,,Dead,Dead
12,46-60,Other,Female,Nasal/throat swab,No,>16 days,Yes,Dead,Jul w1,July,July1,,,,,,,,1.0,,,,,,,1.0,,1.0,,,,,1.0,,1.0,1.0,1.0,1.0,Dead,Dead
13,46-60,Mandalay,Male,Nasal/throat swab,Yes,11-15 days,Yes,Dead,Jul w4,July,July2,,,,,,,,1.0,,,,,,,1.0,,1.0,1.0,,,,,,1.0,1.0,,1.0,Dead,Dead
14,>60,Other,Male,Nasal/throat swab,Yes,>16 days,Yes,Dead,Aug w1,Aug,Aug1,,,,,,,,1.0,,,,,,,1.0,,1.0,1.0,,,1.0,,,,,,1.0,Dead,Dead
15,46-60,Mandalay,Male,Nasal/throat swab,Yes,>16 days,Yes,Complications,Jul w1,July,July1,,,,1.0,1.0,,,,,,,,,,,1.0,1.0,1.0,1.0,,1.0,,1.0,1.0,1.0,,1.0,Complications,Other
16,>60,Mandalay,Other,Nasal/throat swab,Yes,3-5 days,No,Dead,Jul w1,July,July1,1.0,,,,,,,,,1.0,,,,,,,1.0,1.0,,1.0,1.0,,1.0,1.0,,1.0,1.0,Dead,Dead
17,46-60,Yangon,Female,Blood test,Yes,11-15 days,Yes,Dead,Jul w2,July,July1,,1.0,,,,,,,,1.0,,,,,,,1.0,1.0,,,,1.0,,1.0,1.0,1.0,1.0,Dead,Dead
18,31-45,Yangon,Male,Blood test,Yes,6-10 days,No,Complications,Jun w1,June,June1,,,,,,,,,1.0,1.0,,,,,,,1.0,,1.0,1.0,1.0,,,,1.0,,,Complications,Other
19,31-45,Yangon,Male,Not tested,Don't know/Not tested,11-15 days,No,Recovered,Jun w3,June,June2,,,,,1.0,,,,1.0,,,,,,,1.0,1.0,,,,,,,1.0,,,,Recovered,Recovered
20,31-45,Yangon,Female,Not tested,Don't know/Not tested,>16 days,Yes,Complications,Jul w2,July,July1,,,,,1.0,,,,,,,,,,,1.0,1.0,1.0,,,1.0,,,1.0,1.0,1.0,,Complications,Other
21,46-60,Mandalay,Male,Nasal/throat swab,Yes,11-15 days,Yes,Dead,Jul w1,July,July1,,,,,,,,1.0,,,,,,,1.0,,1.0,1.0,,1.0,1.0,,,1.0,1.0,1.0,1.0,Dead,Dead
22,>60,Yangon,Male,Nasal/throat swab,Yes,>16 days,Yes,Dead,Jul w3,July,July2,,,,,1.0,,,,,1.0,,,,,,,1.0,1.0,,,,,,,1.0,,1.0,Dead,Dead
23,>60,Mandalay,Female,Nasal/throat swab,Yes,11-15 days,No,Symptoms remain,Jul w3,July,July2,,1.0,,,,,,,,,,,,,,1.0,1.0,1.0,,,1.0,,,1.0,1.0,,,Symptoms remain,Other
24,>60,Yangon,Male,Nasal/throat swab,Yes,6-10 days,Yes,Dead,Jul w2,July,July1,,,,1.0,,,,,,1.0,,,,,,,1.0,1.0,,,,,,,1.0,,1.0,Dead,Dead
25,16-30,Yangon,Female,Not tested,Don't know/Not tested,11-15 days,No,Recovered,Jul w1,July,July1,1.0,,,,,,,,,,,,,,,1.0,1.0,1.0,,,1.0,,,1.0,1.0,,,Recovered,Recovered
26,16-30,Mandalay,Female,Not tested,Don't know/Not tested,11-15 days,Yes,Complications,Jun w4,June,June2,,,,1.0,,,,,,,,,,,1.0,,1.0,1.0,1.0,,1.0,1.0,1.0,1.0,1.0,,1.0,Complications,Other
27,46-60,Yangon,Male,Not tested,Don't know/Not tested,>16 days,Yes,Dead,Jul w3,July,July2,,,,,1.0,,,,,1.0,,,,,,,1.0,1.0,,,,,,,1.0,,1.0,Dead,Dead
28,>60,Yangon,Male,Nasal/throat swab,Yes,11-15 days,Yes,Dead,Jul w1,July,July1,,,,1.0,1.0,,,,,1.0,,,,,,,,1.0,,1.0,,,,,1.0,,,Dead,Dead
29,46-60,Other,Male,Nasal/throat swab,Yes,>16 days,Yes,Dead,Jun w1,June,June1,,,,,,,,1.0,,,,,,,1.0,,1.0,1.0,,1.0,1.0,1.0,1.0,,1.0,,1.0,Dead,Dead
30,31-45,Yangon,Male,Nasal/throat swab,Yes,>16 days,No,Recovered,Jul w2,July,July1,,,,,1.0,,,,,,,,,,,1.0,1.0,1.0,,,1.0,,,1.0,,,,Recovered,Recovered
31,46-60,Yangon,Female,Nasal/throat swab,Yes,>16 days,Yes,Dead,Jul w1,July,July1,,,,,,,,1.0,,,,,,,1.0,,1.0,,,,1.0,,,1.0,1.0,,1.0,Dead,Dead
32,46-60,Mandalay,Female,Not tested,Don't know/Not tested,>16 days,Yes,Dead,Jun w4,June,June2,,,,1.0,,,,,,1.0,,,,,,,1.0,1.0,1.0,1.0,1.0,1.0,1.0,1.0,1.0,1.0,1.0,Dead,Dead
33,16-30,Yangon,Female,Blood test,Yes,6-10 days,No,Recovered,Jul w3,July,July2,,,,,1.0,,,,,,,,,,,1.0,,,1.0,,1.0,,,1.0,,,,Recovered,Recovered
34,31-45,Yangon,Male,Nasal/throat swab,Yes,>16 days,Yes,Recovered,Jul w2,July,July1,,,,,1.0,,,,,1.0,,,,,,,1.0,,,1.0,,1.0,,,,,,Recovered,Recovered
35,>60,Sagaing,Female,Not tested,Don't know/Not tested,11-15 days,No,Recovered,Jun w4,June,June2,,,,,1.0,,,,,1.0,,,,,,,1.0,,,,1.0,,1.0,1.0,,,,Recovered,Recovered
36,>60,Yangon,Male,Not tested,Don't know/Not tested,>16 days,Yes,Dead,Jul w1,July,July1,,,,,,,,1.0,,,,,,,1.0,,1.0,1.0,,,,1.0,1.0,1.0,1.0,1.0,,Dead,Dead
37,>60,Yangon,Male,Nasal/throat swab,Yes,6-10 days,Yes,Dead,Jul w2,July,July1,,,,1.0,,,,,,,,,,1.0,,,1.0,1.0,1.0,1.0,1.0,1.0,,1.0,,,,Dead,Dead
38,31-45,Other,Male,Not tested,Don't know/Not tested,6-10 days,No,Recovered,Jul w4,July,July2,,,,,1.0,,,,,,,,,,,1.0,1.0,,1.0,,1.0,1.0,1.0,1.0,1.0,1.0,,Recovered,Recovered
39,>60,Sagaing,Female,Not tested,Don't know/Not tested,11-15 days,No,Recovered,Jul w4,July,July2,,,,,1.0,,,,,1.0,,,,,,,1.0,,,,1.0,,,,,,,Recovered,Recovered
40,46-60,Yangon,Female,Not tested,Don't know/Not tested,>16 days,Yes,Complications,Jul w1,July,July1,,,,,,,,,1.0,1.0,,,,,,,1.0,1.0,1.0,1.0,1.0,,1.0,,1.0,,1.0,Complications,Other
41,16-30,Yangon,Female,Not tested,Don't know/Not tested,>16 days,No,Complications,Jul w2,July,July1,,,,,1.0,,,,,1.0,,,,,,,1.0,1.0,1.0,,1.0,,1.0,1.0,1.0,,,Complications,Other
42,46-60,Yangon,Male,Don't know,Don't know/Not tested,11-15 days,Yes,Dead,Jun w1,June,June1,,1.0,,,,,,,,,,,,,,1.0,1.0,1.0,1.0,1.0,,1.0,1.0,1.0,1.0,1.0,1.0,Dead,Dead
43,16-30,Mandalay,Male,Nasal/throat swab,Yes,6-10 days,No,Symptoms remain,Aug w1,Aug,Aug1,,,,,1.0,,,,,1.0,,,,,,,1.0,,,,1.0,,,,,,,Symptoms remain,Other
44,16-30,Yangon,Male,Not tested,Don't know/Not tested,3-5 days,No,Recovered,Jul w1,July,July1,,,,,1.0,,,,,,,,,,,1.0,1.0,,1.0,,1.0,,,,,,,Recovered,Recovered
45,46-60,Yangon,Female,Nasal/throat swab,Yes,>16 days,No,Recovered,Jul w3,July,July2,,,,1.0,1.0,,,,,,,,,,,1.0,1.0,1.0,,,1.0,,,1.0,,,,Recovered,Recovered
46,>60,Yangon,Male,Don't know,Don't know/Not tested,6-10 days,Yes,Dead,Jul w4,July,July2,,,,,1.0,,,,,1.0,,,,,,,1.0,1.0,1.0,,1.0,1.0,,,1.0,,1.0,Dead,Dead
47,>60,Sagaing,Female,Not tested,Don't know/Not tested,>16 days,Yes,Dead,Jul w1,July,July1,,,,,1.0,,,,,,,,,,1.0,,1.0,1.0,1.0,,,,,,,,,Dead,Dead
48,>60,Yangon,Female,Not tested,Don't know/Not tested,6-10 days,Yes,Dead,Jun w3,June,June2,,,,1.0,,,,,,1.0,,,,,,,1.0,,,,,,,1.0,,,,Dead,Dead
49,>60,Yangon,Male,Not tested,Don't know/Not tested,6-10 days,No,Dead,Jul w4,July,July2,,,,,1.0,,,,,1.0,,,,,,,1.0,1.0,,,1.0,,,,1.0,,1.0,Dead,Dead
50,31-45,Mandalay,Male,Nasal/throat swab,Yes,>16 days,Yes,Dead,Jul w4,July,July2,,,,1.0,,,,,,1.0,,,,,,,1.0,1.0,,,,,1.0,1.0,1.0,,1.0,Dead,Dead
51,16-30,Yangon,Female,Not tested,Don't know/Not tested,6-10 days,No,Complications,Jul w4,July,July2,,1.0,,,,,,,,,,,,,,1.0,1.0,1.0,1.0,1.0,1.0,,1.0,1.0,1.0,1.0,1.0,Complications,Other
52,>60,Yangon,Male,Nasal/throat swab,Yes,11-15 days,Yes,Dead,Jul w2,July,July1,,,,1.0,1.0,,,,,1.0,,,,,,,1.0,1.0,,,,,1.0,1.0,1.0,1.0,1.0,Dead,Dead
53,>60,Mandalay,Female,Nasal/throat swab,Yes,11-15 days,No,Complications,Jul w3,July,July2,,,,1.0,1.0,,,,,,,,,,,1.0,1.0,1.0,1.0,1.0,1.0,,1.0,1.0,1.0,1.0,,Complications,Other
54,31-45,Yangon,Female,Not tested,Don't know/Not tested,3-5 days,No,Recovered,Jul w2,July,July1,1.0,,,,,,,,,1.0,,,,,,,1.0,,,,1.0,,,,,,,Recovered,Recovered
55,46-60,Mandalay,Female,Nasal/throat swab,Yes,11-15 days,Yes,Dead,Jun w4,June,June2,,,,1.0,,,,,,1.0,,,,,,,1.0,1.0,,,,,,,1.0,,,Dead,Dead
56,>60,Other,Male,Not tested,Don't know/Not tested,11-15 days,Yes,Dead,Jul w1,July,July1,,,,1.0,,,,,,1.0,,,,,,,1.0,1.0,1.0,1.0,1.0,1.0,1.0,1.0,1.0,1.0,1.0,Dead,Dead
57,16-30,Other,Male,Nasal/throat swab,Yes,6-10 days,No,Recovered,Jul w4,July,July2,1.0,,,,,,,,,1.0,,,,,,,,,,,1.0,,,,,,,Recovered,Recovered
58,>60,Other,Male,Nasal/throat swab,Yes,6-10 days,Yes,Dead,Jul w2,July,July1,,,,,,,,,1.0,1.0,,,,,,,1.0,1.0,,,,,,1.0,1.0,,1.0,Dead,Dead
59,46-60,Yangon,Male,Not tested,Don't know/Not tested,11-15 days,Yes,Dead,Jul w1,July,July1,,,,1.0,1.0,,,,,1.0,,,,,,,1.0,1.0,,,1.0,,,1.0,1.0,,1.0,Dead,Dead
60,>60,Other,Female,Not tested,Don't know/Not tested,>16 days,No,Complications,Jul w1,July,July1,,,,1.0,,,,,,1.0,,,,,,,1.0,1.0,1.0,1.0,1.0,1.0,1.0,1.0,1.0,1.0,1.0,Complications,Other
61,46-60,Yangon,Male,Nasal/throat swab,Yes,>16 days,Yes,Dead,Jul w2,July,July1,,,,,1.0,,,1.0,,,,,,,1.0,,1.0,1.0,,1.0,,1.0,1.0,1.0,1.0,,1.0,Dead,Dead
62,31-45,Mandalay,Female,Nasal/throat swab,Yes,11-15 days,No,Complications,Jul w3,July,July2,,,,1.0,1.0,,,,,,,,,,,1.0,1.0,,1.0,1.0,1.0,1.0,1.0,1.0,1.0,1.0,1.0,Complications,Other
63,31-45,Other,Male,Not tested,Don't know/Not tested,>16 days,No,Recovered,Jun w2,June,June1,,,,,1.0,,,,,1.0,,,,,,,1.0,1.0,1.0,1.0,1.0,1.0,1.0,1.0,1.0,1.0,1.0,Recovered,Recovered
64,16-30,Other,Male,Not tested,Don't know/Not tested,>16 days,No,Recovered,Jul w3,July,July2,,,,,1.0,,,,,1.0,,,,,,,1.0,1.0,,,,,1.0,,,,,Recovered,Recovered
65,46-60,Yangon,Female,Not tested,Don't know/Not tested,6-10 days,Yes,Dead,Jul w3,July,July2,,1.0,,,,,,,,,,,,,,1.0,1.0,,,,1.0,1.0,1.0,,1.0,,1.0,Dead,Dead
66,46-60,Sagaing,Female,Nasal/throat swab,Yes,11-15 days,No,Recovered,Jul w4,July,July2,,,,,1.0,,,,,,,,,,,1.0,1.0,1.0,1.0,,1.0,,,,,,,Recovered,Recovered
67,>60,Yangon,Female,Nasal/throat swab,Yes,>16 days,Yes,Dead,Jul w3,July,July2,,,,1.0,,,,,,1.0,,,,,,,1.0,1.0,,,1.0,,,,1.0,,1.0,Dead,Dead
68,>60,Yangon,Male,Not tested,Don't know/Not tested,6-10 days,No,Dead,Jul w2,July,July1,,,,,1.0,,,,,1.0,,,,,,,1.0,,,,,,1.0,1.0,1.0,,,Dead,Dead
69,46-60,Mandalay,Female,Nasal/throat swab,Yes,6-10 days,Yes,Dead,Jul w4,July,July2,,,,1.0,,,,,,1.0,,,,,,,1.0,1.0,,,,1.0,1.0,1.0,1.0,,1.0,Dead,Dead
70,46-60,Yangon,Male,Not tested,Don't know/Not tested,11-15 days,No,Recovered,Jul w3,July,July2,1.0,,,,,,,,,1.0,,,,,,,1.0,,,,1.0,,,1.0,,1.0,,Recovered,Recovered
71,46-60,Mandalay,Female,Not tested,Don't know/Not tested,6-10 days,Yes,Dead,Jul w1,July,July1,,1.0,,,,,,,,1.0,,,,,,,1.0,1.0,,1.0,,,,,1.0,,,Dead,Dead
72,46-60,Other,Female,Not tested,Don't know/Not tested,11-15 days,Yes,Dead,Jul w3,July,July2,,,,,,1.0,,,,1.0,,,,,,,1.0,1.0,1.0,1.0,1.0,1.0,1.0,1.0,1.0,1.0,1.0,Dead,Dead
73,46-60,Yangon,Male,Don't know,Don't know/Not tested,>16 days,Yes,Dead,Jul w2,July,July1,,,,,1.0,,,,,1.0,,,,,,,1.0,,,,,,,1.0,,,,Dead,Dead
74,31-45,Yangon,Female,Nasal/throat swab,Yes,>16 days,No,Complications,Jul w3,July,July2,1.0,,,,,,,,,,,,,,,1.0,1.0,,,,1.0,,,,1.0,1.0,,Complications,Other
75,>60,Yangon,Female,Not tested,Don't know/Not tested,11-15 days,Yes,Dead,Jul w3,July,July2,,,,,,,,,1.0,1.0,,,,,,,1.0,1.0,,1.0,,,1.0,1.0,1.0,,1.0,Dead,Dead
76,46-60,Yangon,Male,Nasal/throat swab,Yes,11-15 days,Yes,Dead,Jun w2,June,June1,,1.0,,1.0,,,,,,1.0,,,,,,,1.0,1.0,,1.0,,,,,1.0,,1.0,Dead,Dead
77,46-60,Yangon,Female,Not tested,Don't know/Not tested,11-15 days,Don't know,Dead,Aug w2,Aug,Aug1,,1.0,,,,,,,,1.0,,,,,,,1.0,1.0,,,,,,1.0,1.0,,,Dead,Dead
78,16-30,Yangon,Male,Not tested,Don't know/Not tested,11-15 days,No,Recovered,Jul w1,July,July1,,1.0,,,1.0,,,,,,,,,,,1.0,1.0,1.0,1.0,1.0,1.0,1.0,1.0,1.0,1.0,1.0,,Recovered,Recovered
79,>60,Yangon,Female,Not tested,Don't know/Not tested,6-10 days,Yes,Dead,Jul w2,July,July1,,,,1.0,1.0,,,,,1.0,,,,,,,1.0,,1.0,,,,1.0,1.0,,,,Dead,Dead
80,46-60,Yangon,Female,Not tested,Don't know/Not tested,>16 days,No,Complications,Jun w2,June,June1,,,,,1.0,,,,,,,,,,,1.0,1.0,,1.0,1.0,1.0,1.0,1.0,1.0,,1.0,,Complications,Other
81,16-30,Other,Male,Nasal/throat swab,Yes,6-10 days,Yes,Dead,Jul w3,July,July2,,,,,,,,1.0,,,,,,,1.0,,,1.0,,1.0,,1.0,,,,1.0,,Dead,Dead
82,>60,Yangon,Male,Nasal/throat swab,Yes,>16 days,Yes,Dead,Jul w2,July,July1,,,,1.0,,,1.0,,,,,,,1.0,,,1.0,1.0,1.0,1.0,1.0,1.0,1.0,1.0,1.0,1.0,1.0,Dead,Dead
83,16-30,Yangon,Female,Nasal/throat swab,No,>16 days,No,Complications,Jul w2,July,July1,,,,,1.0,,,,,,,,,,,1.0,1.0,1.0,,1.0,1.0,1.0,,,1.0,1.0,1.0,Complications,Other
84,>60,Yangon,Female,Not tested,Don't know/Not tested,6-10 days,No,Dead,Jul w1,July,July1,1.0,,,,,,,,,1.0,,,,,,,1.0,1.0,,,,,,,1.0,,1.0,Dead,Dead
85,>60,Yangon,Female,Not tested,Don't know/Not tested,6-10 days,Yes,Dead,Jul w2,July,July1,,1.0,,,,,,1.0,,,,,,,1.0,,1.0,1.0,,,1.0,,1.0,1.0,1.0,,1.0,Dead,Dead
86,>60,Yangon,Female,Nasal/throat swab,Yes,6-10 days,Yes,Dead,Jul w1,July,July1,,,,1.0,,,,,,1.0,,,,,,,1.0,1.0,,,,,,,,,1.0,Dead,Dead
87,46-60,Yangon,Female,Not tested,Don't know/Not tested,3-5 days,No,Dead,Jul w4,July,July2,1.0,,,,,,,,,1.0,,,,,,,1.0,,,,,,,,,,1.0,Dead,Dead
88,46-60,Mandalay,Female,Nasal/throat swab,Yes,11-15 days,No,Dead,Jun w4,June,June2,1.0,,,,,,,,,,,,,,1.0,,1.0,1.0,1.0,,,,,1.0,1.0,1.0,,Dead,Dead
89,31-45,Yangon,Female,Nasal/throat swab,Yes,6-10 days,No,Recovered,Jul w1,July,July1,1.0,,,,,,,,,1.0,,,,,,,1.0,1.0,,,1.0,1.0,,1.0,,,,Recovered,Recovered
90,>60,Mandalay,Male,Not tested,Don't know/Not tested,6-10 days,Yes,Dead,Jul w4,July,July2,,1.0,,,,,,,,1.0,,,,,,,1.0,1.0,,,,,,1.0,,1.0,1.0,Dead,Dead
91,>60,Sagaing,Female,Not tested,Yes,6-10 days,Yes,Dead,Jul w4,July,July2,,,,,,,,1.0,,,,,,,1.0,,1.0,,,,,,1.0,,,,,Dead,Dead
92,46-60,Mandalay,Male,Nasal/throat swab,Yes,6-10 days,Yes,Dead,Jul w3,July,July2,,,,1.0,,,,,,1.0,,,,,,,,,,,,,,,,,1.0,Dead,Dead
93,16-30,Other,Male,Not tested,Don't know/Not tested,11-15 days,No,Recovered,Jul w4,July,July2,,,,1.0,,,,,,1.0,,,,,,,1.0,,,1.0,1.0,,1.0,1.0,,,,Recovered,Recovered
94,>60,Other,Male,Nasal/throat swab,Yes,6-10 days,No,Dead,Jun w3,June,June2,,,,,,,,,1.0,1.0,,,,,,,1.0,1.0,,,,,1.0,1.0,1.0,1.0,1.0,Dead,Dead
95,>60,Yangon,Male,Not tested,Don't know/Not tested,>16 days,Yes,Dead,Jul w3,July,July2,,,,1.0,,,,,,1.0,,,,,,,1.0,,,,,,,1.0,1.0,1.0,,Dead,Dead
96,,Yangon,Male,Nasal/throat swab,Yes,3-5 days,Yes,Dead,Jul w4,July,July2,,,,1.0,,,,,,1.0,,,,,,,1.0,1.0,,,1.0,,,1.0,,,1.0,Dead,Dead
97,16-30,Yangon,Female,Not tested,Don't know/Not tested,11-15 days,No,Complications,Jul w1,July,July1,,,,,1.0,,,,,1.0,,,,,,,1.0,1.0,,1.0,,,1.0,1.0,1.0,,,Complications,Other
98,16-30,Other,Male,Not tested,Don't know/Not tested,6-10 days,No,Complications,Jul w1,July,July1,,1.0,,,,,,,,,,,,,,1.0,1.0,1.0,1.0,,1.0,,1.0,1.0,,1.0,,Complications,Other
99,>60,Yangon,Male,Not tested,Don't know/Not tested,>16 days,Yes,Complications,Jul w3,July,July2,,,,1.0,1.0,,,,,,,,,,,,,1.0,,,,,,1.0,,,,Complications,Other
100,31-45,Yangon,Female,Don't know,Don't know/Not tested,6-10 days,Yes,Dead,Jul w4,July,July2,,1.0,,,,,,,,1.0,,,,,,,,1.0,,,,,,,1.0,,1.0,Dead,Dead
101,31-45,Other,Female,Not tested,Yes,11-15 days,No,Symptoms remain,Jul w4,July,July2,,1.0,,,,,,,,1.0,,,,,,,1.0,1.0,,,,,,,,,,Symptoms remain,Other
102,31-45,Other,Male,Nasal/throat swab,Yes,11-15 days,No,Recovered,Jul w2,July,July1,,1.0,,,1.0,,,,,,,,,,,,1.0,1.0,,1.0,1.0,1.0,1.0,1.0,1.0,1.0,1.0,Recovered,Recovered
103,>60,Yangon,Female,Not tested,Don't know/Not tested,6-10 days,Yes,Complications,Jun w1,June,June1,,,,,,,,,1.0,,,,,,,,1.0,1.0,,,,,,,,,,Complications,Other
104,16-30,Yangon,Female,Nasal/throat swab,No,>16 days,No,Symptoms remain,Jun w2,June,June1,,,,,1.0,,,,,,,,,,,,1.0,,,,1.0,,,,,,,Symptoms remain,Other
105,46-60,Mandalay,Female,Not tested,Don't know/Not tested,11-15 days,No,Recovered,Jul w4,July,July2,,,,,1.0,,,,,,,,,,,,1.0,1.0,1.0,,1.0,1.0,,1.0,,,,Recovered,Recovered
106,>60,Yangon,Female,Nasal/throat swab,Yes,>16 days,No,Recovered,Jul w1,July,July1,,,,,,,,,1.0,,,,,,,,1.0,1.0,1.0,1.0,1.0,1.0,1.0,1.0,1.0,1.0,,Recovered,Recovered
107,46-60,Yangon,Female,Not tested,Don't know/Not tested,11-15 days,Yes,Dead,Jun w3,June,June2,,,,1.0,,,,,,1.0,,,,,,,1.0,1.0,,,,,,1.0,1.0,1.0,1.0,Dead,Dead
108,31-45,Yangon,Female,Blood test,Yes,11-15 days,No,Complications,Jun w4,June,June2,,,,,1.0,,,,,,,,,,,,1.0,,,,1.0,,,1.0,,1.0,1.0,Complications,Other
109,46-60,Other,Male,Not tested,Don't know/Not tested,>16 days,No,Complications,Jul w2,July,July1,,,,,1.0,,,,,,,,,,,,1.0,1.0,,,,1.0,1.0,1.0,1.0,1.0,,Complications,Other
110,31-45,Yangon,Female,Not tested,Don't know/Not tested,6-10 days,No,Complications,Jul w3,July,July2,,,,,,,,,1.0,,,,,,,,1.0,,,,1.0,,1.0,1.0,,,1.0,Complications,Other
111,>60,Yangon,Male,Nasal/throat swab,Yes,>16 days,Yes,Symptoms remain,Jul w3,July,July2,,,,1.0,,,,,,,,,,,,,1.0,1.0,1.0,1.0,,,,1.0,1.0,,1.0,Symptoms remain,Other
112,>60,Mandalay,Male,Nasal/throat swab,Yes,3-5 days,No,Dead,Aug w2,Aug,Aug1,,1.0,,,,,,,,1.0,,,,,,,1.0,,,,,,,,1.0,,1.0,Dead,Dead
113,16-30,Yangon,Female,Nasal/throat swab,Yes,11-15 days,No,Complications,Jul w3,July,July2,1.0,,,,,,,,,,,,,,,1.0,1.0,1.0,1.0,,1.0,,1.0,1.0,,1.0,,Complications,Other
114,31-45,Other,Male,Not tested,Don't know/Not tested,6-10 days,No,Recovered,Jul w4,July,July2,,1.0,,,,,,,,,,,,,,,1.0,1.0,1.0,,1.0,,,,1.0,,,Recovered,Recovered
115,46-60,Yangon,Male,Nasal/throat swab,Yes,3-5 days,No,Symptoms remain,Jul w4,July,July2,,,,,1.0,,,,,,,,,,,,1.0,,,,,,,,,,,Symptoms remain,Other
116,16-30,Yangon,Female,Not tested,Don't know/Not tested,11-15 days,No,Recovered,Jul w2,July,July1,,,,,1.0,,,,,,,,,,,,1.0,1.0,,,1.0,,,,1.0,,,Recovered,Recovered
117,31-45,Mandalay,Female,Nasal/throat swab,Yes,3-5 days,No,Recovered,Jul w2,July,July1,1.0,,,,,,,,,,,,,,,,1.0,,1.0,,1.0,,1.0,1.0,,,,Recovered,Recovered
118,>60,Other,Male,Not tested,Don't know/Not tested,11-15 days,Yes,Dead,Aug w1,Aug,Aug1,,,,,1.0,,,,,1.0,,,,,,,1.0,1.0,,,,,,,1.0,1.0,1.0,Dead,Dead
119,46-60,Mandalay,Female,Nasal/throat swab,Yes,11-15 days,No,Recovered,Jul w3,July,July2,,,,,,,,,1.0,,,,,,,,1.0,1.0,1.0,1.0,1.0,,1.0,1.0,,1.0,,Recovered,Recovered
120,46-60,Other,Male,Nasal/throat swab,Yes,6-10 days,No,Recovered,Jul w1,July,July1,,,,,,,,,1.0,,,,,,,,1.0,,1.0,,1.0,,1.0,,,1.0,,Recovered,Recovered
121,46-60,Yangon,Female,Not tested,Don't know/Not tested,11-15 days,No,Complications,Jul w3,July,July2,1.0,,,,,,,,,,,,,,,,1.0,,,,,,1.0,1.0,1.0,1.0,,Complications,Other
122,46-60,Mandalay,Female,Nasal/throat swab,Yes,>16 days,Yes,Complications,Jun w2,June,June1,,1.0,,,,,,,,,,,,,,,1.0,,,,,1.0,,1.0,1.0,,1.0,Complications,Other
123,46-60,Mandalay,Male,Nasal/throat swab,Yes,11-15 days,No,Recovered,Jul w4,July,July2,,,,,1.0,,,,,,,,,,,,,1.0,1.0,,1.0,,,,,,,Recovered,Recovered
124,16-30,Yangon,Male,Not tested,Don't know/Not tested,6-10 days,No,Recovered,Jul w2,July,July1,1.0,,,,,,,,,,,,,,,,1.0,1.0,1.0,1.0,1.0,1.0,1.0,1.0,1.0,,1.0,Recovered,Recovered
125,16-30,Mandalay,Male,Not tested,Don't know/Not tested,11-15 days,Yes,Dead,Jul w3,July,July2,1.0,,,,,,,,,1.0,,,,,,,1.0,1.0,,,,,,,,,,Dead,Dead
126,46-60,Other,Male,Nasal/throat swab,Yes,>16 days,Yes,Symptoms remain,Jul w3,July,July2,,,,1.0,1.0,,,,,,,,,,,,1.0,1.0,,,,,1.0,,1.0,,1.0,Symptoms remain,Other
127,>60,Yangon,Female,Nasal/throat swab,Yes,>16 days,No,Complications,Jul w2,July,July1,,,,,1.0,,,,,,,,,,,,1.0,1.0,,1.0,,,,1.0,1.0,1.0,1.0,Complications,Other
128,>60,Mandalay,Female,Nasal/throat swab,Yes,3-5 days,No,Recovered,Jul w3,July,July2,,,,1.0,,,,,,,,,,,,1.0,1.0,,,,1.0,,,,,,,Recovered,Recovered
129,>60,Yangon,Male,Not tested,Don't know/Not tested,>16 days,Yes,Dead,Jul w2,July,July1,,,,,1.0,,,,,1.0,,,,,,,1.0,1.0,1.0,,1.0,,,,,,,Dead,Dead
130,31-45,Mandalay,Female,Not tested,Don't know/Not tested,6-10 days,No,Complications,Jul w2,July,July1,,1.0,,,,,,,,,,,,,,,1.0,1.0,,1.0,1.0,,1.0,,,1.0,,Complications,Other
131,16-30,Yangon,Female,Not tested,Don't know/Not tested,3-5 days,No,Recovered,Jul w2,July,July1,,1.0,,,,,,,,,,,,,,,1.0,1.0,,,1.0,,,,,,,Recovered,Recovered
132,31-45,Yangon,Male,Nasal/throat swab,No,3-5 days,No,Recovered,Jul w4,July,July2,,,,1.0,,,,,,,,,,,,,,,,,,,1.0,,,1.0,,Recovered,Recovered
133,31-45,Other,Male,Not tested,Don't know/Not tested,>16 days,No,Recovered,Jul w3,July,July2,,1.0,,,1.0,,,,,,,,,,,,1.0,1.0,,1.0,,,1.0,1.0,1.0,,1.0,Recovered,Recovered
134,46-60,Other,Male,Blood test,Yes,>16 days,Yes,Recovered,Jun w4,June,June2,,,,,,,,1.0,,,,,,,,,1.0,1.0,1.0,,1.0,1.0,,1.0,1.0,,1.0,Recovered,Recovered
135,46-60,Yangon,Female,Not tested,Don't know/Not tested,6-10 days,Yes,Dead,Jul w2,July,July1,,,,,,,,,1.0,1.0,,,,,,,1.0,1.0,1.0,,,,1.0,1.0,,,1.0,Dead,Dead
136,46-60,Other,Male,Not tested,Don't know/Not tested,11-15 days,No,Recovered,Jul w1,July,July1,,1.0,,,,,,,,,,,,,,,1.0,1.0,,,,1.0,,1.0,,,,Recovered,Recovered
137,31-45,Yangon,Female,Not tested,Don't know/Not tested,6-10 days,No,Recovered,Jul w2,July,July1,1.0,,,,,,,,,,,,,,,,1.0,1.0,1.0,1.0,1.0,,1.0,,,,,Recovered,Recovered
138,16-30,Yangon,Male,Not tested,Don't know/Not tested,11-15 days,No,Recovered,Jul w2,July,July1,,1.0,,,,,,,,,,,,,,,1.0,1.0,,1.0,1.0,,,1.0,,1.0,,Recovered,Recovered
139,>60,Yangon,Female,Not tested,Don't know/Not tested,3-5 days,No,Recovered,Jul w1,July,July1,,,,,1.0,,,,,,,,,,,,1.0,,1.0,1.0,1.0,,,,,,,Recovered,Recovered
140,31-45,Mandalay,Female,Nasal/throat swab,Yes,6-10 days,No,Complications,Jul w2,July,July1,,,,,,,,,1.0,,,,,,,,1.0,,,1.0,1.0,,1.0,1.0,1.0,,1.0,Complications,Other
141,31-45,Yangon,Female,Not tested,Don't know/Not tested,11-15 days,No,Complications,Jul w3,July,July2,,,,,1.0,,,,,,,,,,,,1.0,1.0,1.0,,1.0,,1.0,1.0,1.0,,1.0,Complications,Other
142,31-45,Yangon,Male,Nasal/throat swab,Yes,11-15 days,No,Recovered,Jul w3,July,July2,,,,,,,,,1.0,,,,,,,,1.0,,1.0,,1.0,,1.0,,,1.0,,Recovered,Recovered
143,>60,Yangon,Male,Not tested,Don't know/Not tested,>16 days,No,Complications,Jul w2,July,July1,,,,,1.0,,,,,,,,,,,,1.0,1.0,1.0,1.0,1.0,1.0,1.0,1.0,1.0,1.0,,Complications,Other
144,31-45,Yangon,Female,Nasal/throat swab,No,6-10 days,No,Recovered,Jun w2,June,June1,1.0,,,,,,,,,,,,,,,,1.0,,,,1.0,,,1.0,,,,Recovered,Recovered
145,31-45,Other,Male,Not tested,Don't know/Not tested,6-10 days,No,Symptoms remain,Aug w1,Aug,Aug1,,,,,1.0,,,,,,,,,,,,,,,,1.0,,,,1.0,,1.0,Symptoms remain,Other
146,31-45,Yangon,Female,Not tested,Don't know/Not tested,11-15 days,No,Recovered,Jul w2,July,July1,,,,,1.0,,,,,,,,,,,,1.0,1.0,,,1.0,,,,,,,Recovered,Recovered
147,31-45,Other,Female,Nasal/throat swab,Yes,6-10 days,No,Recovered,Jul w4,July,July2,,,,,1.0,,,,,,,,,,,,1.0,1.0,1.0,,1.0,,1.0,1.0,,,,Recovered,Recovered
148,31-45,Yangon,Female,Not tested,Don't know/Not tested,6-10 days,No,Complications,Jul w2,July,July1,,,,1.0,,,,,,,,,,,,,1.0,1.0,1.0,1.0,1.0,,1.0,1.0,1.0,1.0,1.0,Complications,Other
149,16-30,Yangon,Female,Not tested,Don't know/Not tested,>16 days,No,Recovered,Jul w3,July,July2,,1.0,,,,,,,,,,,,,,,1.0,1.0,1.0,1.0,1.0,,,,1.0,,1.0,Recovered,Recovered
150,16-30,Other,Male,Not tested,Don't know/Not tested,11-15 days,No,Recovered,Jul w4,July,July2,,,,,1.0,,,,,,,,,,,,1.0,1.0,1.0,1.0,1.0,,1.0,1.0,1.0,1.0,1.0,Recovered,Recovered
151,31-45,Yangon,Female,Not tested,Don't know/Not tested,>16 days,Yes,Complications,Jul w3,July,July2,,,,1.0,1.0,,,,,,,,,,,,,,,,1.0,,,,,1.0,,Complications,Other